{"text_format":"1","workbook":"xlsx","n_sheets":21,"sheets":["sys","mst","スタートページ","入力画面(入力シートその１)","入力画面(入力シートその２)","入力画面(入力シートその３)","入力・印刷兼用(役員名簿)","印刷画面","印刷用（申請書１）","印刷用（申請書２）","印刷用（経営規模等総括表）","印刷用（営業品目調書）","印刷用（誓約書）","印刷用（委任状）","印刷用(使用印鑑届)","印刷用(暴力団排除条例誓約書)","印刷用(市内事務所等調書)","印刷用(受理証)","印刷用(提出書類チェック表（市内）)","印刷用(提出書類チェック表（市外）)","印刷用(CDラベル・宛名ラベル)"],"not_rendered":{"charts":0,"images":29,"macros":1,"external_links":0,"defined_names":6,"comments":1,"pivot_tables":0},"unopened":[],"bounds":{"document_bytes":16777216,"sheet_cells":100000,"rows_first":2000,"rows_last":500,"rows_between":2000,"halvings":0,"cell_chars":16384,"cell_head_chars":4096},"cells_cut":0,"cells_raw":0,"read":"whole","date_system":"1900"}

{"sheet":"sys","index":0,"n_rows":320,"n_cols":30,"rows_kept":320,"cut":false,"hidden":true,"merged":[]}
["id","p1_1","p2_1","p2_2","p2_3","p2_4","p2_5","p2_6","p2_7","p2_8","p2_9","p2_10","p2_11","p2_12","p2_13","p2_14","p3_1","p3_2","p3_3","p3_4","p4_1","p5_1","p5_2","p5_3","p5_4","p5_5","p5_6","p5_7","p5_8","p5_9"]
[1,{"$f":"IF(ISBLANK('入力画面(入力シートその１)'!G13),\"\",'入力画面(入力シートその１)'!G13)","v":""},{"$f":"IF('入力画面(入力シートその２)'!B11<>\"\",'入力画面(入力シートその２)'!B11,\"\")","v":""},{"$f":"IF('入力画面(入力シートその２)'!E11<>\"\",'入力画面(入力シートその２)'!E11,\"\")","v":""},{"$f":"IF('入力画面(入力シートその２)'!H11<>\"\",'入力画面(入力シートその２)'!H11,\"\")","v":""},{"$f":"IF('入力画面(入力シートその２)'!O11<>\"\",'入力画面(入力シートその２)'!O11,\"\")","v":""},{"$f":"IF('入力画面(入力シートその２)'!AM11<>\"\",'入力画面(入力シートその２)'!AM11,\"\")","v":""},null,null,null,null,null,null,null,null,null,{"$f":"IF('入力画面(入力シートその３)'!B3<>\"\",'入力画面(入力シートその３)'!B3,\"\")","v":""},{"$f":"IF('入力画面(入力シートその３)'!D3<>\"\",'入力画面(入力シートその３)'!D3,\"\")","v":""},{"$f":"IF('入力画面(入力シートその３)'!E3<>\"\",'入力画面(入力シートその３)'!E3,\"\")","v":""},{"$f":"IF('入力画面(入力シートその３)'!H3<>\"\",'入力画面(入力シートその３)'!H3,\"\")","v":""}]
[2,{"$f":"IF(ISBLANK('入力画面(入力シートその１)'!G14),\"\",'入力画面(入力シートその１)'!G14)","v":""},{"$f":"IF('入力画面(入力シートその２)'!B12<>\"\",'入力画面(入力シートその２)'!B12,\"\")","v":""},{"$f":"IF('入力画面(入力シートその２)'!E12<>\"\",'入力画面(入力シートその２)'!E12,\"\")","v":""},{"$f":"IF('入力画面(入力シートその２)'!H12<>\"\",'入力画面(入力シートその２)'!H12,\"\")","v":""},{"$f":"IF('入力画面(入力シートその２)'!O12<>\"\",'入力画面(入力シートその２)'!O12,\"\")","v":""},{"$f":"IF('入力画面(入力シートその２)'!AM12<>\"\",'入力画面(入力シートその２)'!AM12,\"\")","v":""},null,null,null,null,null,null,null,null,null,{"$f":"IF('入力画面(入力シートその３)'!B4<>\"\",'入力画面(入力シートその３)'!B4,\"\")","v":""},{"$f":"IF('入力画面(入力シートその３)'!D4<>\"\",'入力画面(入力シートその３)'!D4,\"\")","v":""},{"$f":"IF('入力画面(入力シートその３)'!E4<>\"\",'入力画面(入力シートその３)'!E4,\"\")","v":""},{"$f":"IF('入力画面(入力シートその３)'!H4<>\"\",'入力画面(入力シートその３)'!H4,\"\")","v":""}]
[3,{"$f":"IF(ISBLANK('入力画面(入力シートその１)'!G15),\"\",'入力画面(入力シートその１)'!G15)","v":""},{"$f":"IF('入力画面(入力シートその２)'!B13<>\"\",'入力画面(入力シートその２)'!B13,\"\")","v":""},{"$f":"IF('入力画面(入力シートその２)'!E13<>\"\",'入力画面(入力シートその２)'!E13,\"\")","v":""},{"$f":"IF('入力画面(入力シートその２)'!H13<>\"\",'入力画面(入力シートその２)'!H13,\"\")","v":""},{"$f":"IF('入力画面(入力シートその２)'!O13<>\"\",'入力画面(入力シートその２)'!O13,\"\")","v":""},{"$f":"IF('入力画面(入力シートその２)'!AM13<>\"\",'入力画面(入力シートその２)'!AM13,\"\")","v":""},null,null,null,null,null,null,null,null,null,{"$f":"IF('入力画面(入力シートその３)'!B5<>\"\",'入力画面(入力シートその３)'!B5,\"\")","v":""},{"$f":"IF('入力画面(入力シートその３)'!D5<>\"\",'入力画面(入力シートその３)'!D5,\"\")","v":""},{"$f":"IF('入力画面(入力シートその３)'!E5<>\"\",'入力画面(入力シートその３)'!E5,\"\")","v":""},{"$f":"IF('入力画面(入力シートその３)'!H5<>\"\",'入力画面(入力シートその３)'!H5,\"\")","v":""}]
[4,null,{"$f":"IF('入力画面(入力シートその２)'!B14<>\"\",'入力画面(入力シートその２)'!B14,\"\")","v":""},{"$f":"IF('入力画面(入力シートその２)'!E14<>\"\",'入力画面(入力シートその２)'!E14,\"\")","v":""},{"$f":"IF('入力画面(入力シートその２)'!H14<>\"\",'入力画面(入力シートその２)'!H14,\"\")","v":""},{"$f":"IF('入力画面(入力シートその２)'!O14<>\"\",'入力画面(入力シートその２)'!O14,\"\")","v":""},{"$f":"IF('入力画面(入力シートその２)'!AM14<>\"\",'入力画面(入力シートその２)'!AM14,\"\")","v":""},null,null,null,null,null,null,null,null,null,{"$f":"IF('入力画面(入力シートその３)'!B6<>\"\",'入力画面(入力シートその３)'!B6,\"\")","v":""},{"$f":"IF('入力画面(入力シートその３)'!D6<>\"\",'入力画面(入力シートその３)'!D6,\"\")","v":""},{"$f":"IF('入力画面(入力シートその３)'!E6<>\"\",'入力画面(入力シートその３)'!E6,\"\")","v":""},{"$f":"IF('入力画面(入力シートその３)'!H6<>\"\",'入力画面(入力シートその３)'!H6,\"\")","v":""}]
[5,{"$f":"IF(ISBLANK('入力画面(入力シートその１)'!G17),\"\",'入力画面(入力シートその１)'!G17)","v":""},{"$f":"IF('入力画面(入力シートその２)'!B15<>\"\",'入力画面(入力シートその２)'!B15,\"\")","v":""},{"$f":"IF('入力画面(入力シートその２)'!E15<>\"\",'入力画面(入力シートその２)'!E15,\"\")","v":""},{"$f":"IF('入力画面(入力シートその２)'!H15<>\"\",'入力画面(入力シートその２)'!H15,\"\")","v":""},{"$f":"IF('入力画面(入力シートその２)'!O15<>\"\",'入力画面(入力シートその２)'!O15,\"\")","v":""},{"$f":"IF('入力画面(入力シートその２)'!AM15<>\"\",'入力画面(入力シートその２)'!AM15,\"\")","v":""},null,null,null,null,null,null,null,null,null,{"$f":"IF('入力画面(入力シートその３)'!B7<>\"\",'入力画面(入力シートその３)'!B7,\"\")","v":""},{"$f":"IF('入力画面(入力シートその３)'!D7<>\"\",'入力画面(入力シートその３)'!D7,\"\")","v":""},{"$f":"IF('入力画面(入力シートその３)'!E7<>\"\",'入力画面(入力シートその３)'!E7,\"\")","v":""},{"$f":"IF('入力画面(入力シートその３)'!H7<>\"\",'入力画面(入力シートその３)'!H7,\"\")","v":""}]
[6,{"$f":"IF(ISBLANK('入力画面(入力シートその１)'!G18),\"\",'入力画面(入力シートその１)'!G18)","v":""},{"$f":"IF('入力画面(入力シートその２)'!B16<>\"\",'入力画面(入力シートその２)'!B16,\"\")","v":""},{"$f":"IF('入力画面(入力シートその２)'!E16<>\"\",'入力画面(入力シートその２)'!E16,\"\")","v":""},{"$f":"IF('入力画面(入力シートその２)'!H16<>\"\",'入力画面(入力シートその２)'!H16,\"\")","v":""},{"$f":"IF('入力画面(入力シートその２)'!O16<>\"\",'入力画面(入力シートその２)'!O16,\"\")","v":""},{"$f":"IF('入力画面(入力シートその２)'!AM16<>\"\",'入力画面(入力シートその２)'!AM16,\"\")","v":""},null,null,null,null,null,null,null,null,null,{"$f":"IF('入力画面(入力シートその３)'!B8<>\"\",'入力画面(入力シートその３)'!B8,\"\")","v":""},{"$f":"IF('入力画面(入力シートその３)'!D8<>\"\",'入力画面(入力シートその３)'!D8,\"\")","v":""},{"$f":"IF('入力画面(入力シートその３)'!E8<>\"\",'入力画面(入力シートその３)'!E8,\"\")","v":""},{"$f":"IF('入力画面(入力シートその３)'!H8<>\"\",'入力画面(入力シートその３)'!H8,\"\")","v":""}]
[7,{"$f":"IF(ISBLANK('入力画面(入力シートその１)'!G19),\"\",'入力画面(入力シートその１)'!G19)","v":""},{"$f":"IF('入力画面(入力シートその２)'!B17<>\"\",'入力画面(入力シートその２)'!B17,\"\")","v":""},{"$f":"IF('入力画面(入力シートその２)'!E17<>\"\",'入力画面(入力シートその２)'!E17,\"\")","v":""},{"$f":"IF('入力画面(入力シートその２)'!H17<>\"\",'入力画面(入力シートその２)'!H17,\"\")","v":""},{"$f":"IF('入力画面(入力シートその２)'!O17<>\"\",'入力画面(入力シートその２)'!O17,\"\")","v":""},{"$f":"IF('入力画面(入力シートその２)'!AM17<>\"\",'入力画面(入力シートその２)'!AM17,\"\")","v":""},null,null,null,null,null,null,null,null,null,{"$f":"IF('入力画面(入力シートその３)'!B9<>\"\",'入力画面(入力シートその３)'!B9,\"\")","v":""},{"$f":"IF('入力画面(入力シートその３)'!D9<>\"\",'入力画面(入力シートその３)'!D9,\"\")","v":""},{"$f":"IF('入力画面(入力シートその３)'!E9<>\"\",'入力画面(入力シートその３)'!E9,\"\")","v":""},{"$f":"IF('入力画面(入力シートその３)'!H9<>\"\",'入力画面(入力シートその３)'!H9,\"\")","v":""}]
{"$rows_left_out":313}
{"sheet":"mst","index":1,"n_rows":49,"n_cols":58,"rows_kept":49,"cut":false,"hidden":true,"merged":[]}
["法人格",null,"ID","分類","No",null,null,null,null,null,"所在区分名",null,null,null,"都道府県コード",null,null,"市町村コード",null,null,"管轄事務所コード",null,"表示",null,null,null,null,null,null,null,null,null,null,null,null,null,null,null,null,null,null,null,"申請区分",null,"許可区分",null,"番号","特般区分",null,"新規継続区分",null,"有無",null,"ISO有無",null,"口座種類",null,"希望順位区分"]
[null,null,null,null,null,null,null,null,null,null,"町内",null,null,"00","大臣",null,2018,"大津市",null,null,null,null,"１：希望する",null,null,null,null,null,null,null,null,null,null,null,null,null,null,null,null,null,null,null,null,null,null,null,null,null,null,"１：新規"]
["株式会社･･･",null,1,"印刷・製本類",1,null,null,null,null,null,"県内",null,null,"01","北海道",null,2026,"彦根市",null,null,null,null,"０：希望しない",null,null,null,null,null,null,null,null,null,null,null,null,null,null,null,null,null,null,null,"○",null,"般",null,1,"般",null,"２：継続",null,"○",null,"0：無",null,"当座",null,1]
["･･･株式会社",null,2,"写真・コピー類",2,null,null,null,null,null,"県外",null,null,"02","青森県",null,2034,"長浜市",null,null,null,null,null,null,null,null,null,null,null,null,null,null,null,null,null,null,null,null,null,null,null,null,null,null,"特",null,2,"特",null,null,null,null,null,"1：有",null,"普通",null,2]
["有限会社･･･",null,3,"オフィス用品類",3,null,null,null,null,null,null,null,null,"03","岩手県",null,2042,"近江八幡市",null,null,null,null,null,null,null,null,null,null,null,null,null,null,null,null,null,null,null,null,null,null,null,null,null,null,null,null,3,"両方",null,null,null,null,null,null,null,null,null,3]
["･･･有限会社",null,4,"コンピュータ類",4,null,null,null,null,null,null,null,null,"04","宮城県",null,2069,"草津市",null,null,null,null,null,null,null,null,null,null,null,null,null,null,null,null,null,null,null,null,null,null,null,null,null,null,null,null,null,null,null,null,null,null,null,null,null,null,null,4]
["協同組合･･･",null,5,"図書・新聞類",5,null,null,null,null,null,null,null,null,"05","秋田県",null,2077,"守山市",null,null,null,null,null,null,null,null,null,null,null,null,null,null,null,null,null,null,null,null,null,null,null,null,null,null,null,null,null,null,null,null,null,null,null,null,null,null,null,5]
["･･･協同組合",null,6,"教材・手芸・楽器・遊具類",6,null,null,null,null,null,null,null,null,"06","山形県",null,2085,"栗東市"]
{"$rows_left_out":42}
{"sheet":"スタートページ","index":2,"n_rows":96,"n_cols":9,"rows_kept":96,"cut":false,"hidden":false,"merged":[]}
["野洲市入札参加資格審査申請書入力　スタートページ"]
[null,null,null,null,null,null,null,null,"令和5年11月15日更新"]
[]
["入力を始める場合は↓このボタンを押して下さい。"]
[]
[]
[]
[]
{"$rows_left_out":89}
{"sheet":"入力画面(入力シートその１)","index":3,"n_rows":59,"n_cols":30,"rows_kept":59,"cut":false,"hidden":true,"merged":[[57,2,57,4],[57,6,57,11],[58,2,58,4],[58,6,58,11],[54,1,54,6],[54,7,54,12],[54,13,54,15],[54,16,54,19],[54,20,54,23],[55,1,55,6],[55,7,55,12],[55,13,55,15],[55,16,55,19],[55,20,55,23],[50,1,50,6],[50,7,50,14],[50,15,50,18],[50,19,50,20],[53,1,53,6],[53,7,53,12],[53,13,53,15],[53,16,53,19],[53,20,53,23],[48,1,48,6],[48,7,48,12],[48,13,48,14],[48,15,49,18],[48,19,49,20],[49,1,49,2],[49,3,49,5],[49,7,49,12],[49,13,49,14],[46,1,47,6],[46,7,46,12],[46,13,46,14],[46,15,47,18],[46,19,47,20],[47,7,47,12],[47,13,47,14],[41,1,41,5],[41,6,41,11],[42,1,42,5],[42,6,42,11],[44,1,44,20],[45,1,45,6],[45,7,45,14],[45,15,45,20],[36,1,36,5],[36,6,36,11],[38,1,38,5],[38,6,38,11],[39,1,39,5],[39,6,39,11],[33,1,33,5],[33,6,33,11],[34,1,34,5],[34,6,34,11],[35,1,35,5],[35,6,35,11],[27,2,27,4],[27,6,27,16],[30,1,30,5],[30,6,30,11],[30,15,30,30],[31,1,32,5],[31,6,31,11],[31,12,31,13],[32,6,32,11],[32,12,32,13],[25,2,25,4],[25,6,25,16],[25,17,25,27],[26,2,26,4],[26,6,26,16],[26,17,26,27],[23,2,23,4],[23,6,23,16],[23,17,23,27],[24,2,24,4],[24,6,24,16],[24,17,24,27],[21,2,21,4],[21,6,21,16],[21,17,21,27],[22,2,22,4],[22,6,22,16],[22,17,22,27],[19,2,19,4],[19,6,19,16],[19,17,19,27],[20,2,20,4],[20,6,20,16],[20,17,20,27],[17,2,17,4],[17,6,17,16],[17,17,17,27],[18,2,18,4],[18,6,18,16],[18,17,18,27],[15,2,15,4],[15,6,15,16],[15,17,15,27],[16,2,16,4],[16,6,16,16],[16,17,16,27],[13,2,13,4],[13,6,13,16],[13,17,13,27],[14,2,14,4],[14,6,14,16],[14,17,14,27],[11,1,11,5],[11,7,11,15],[11,18,11,26],[12,2,12,4],[12,6,12,16],[12,17,12,27]]}
["入札参加資格審査申請書（物品・役務の提供）",null,null,null,null,null,null,null,null,null,null,null,null,null,null,null,null,null,null,null,null,null,null,"【入力シート　その１】"]
[]
[null,"※入力の注意点"]
[null,"・","従業員数には臨時または日雇いの従業員は含みません"]
[null,"・","*が付いている項目に関してはﾘｽﾄから選択して下さい"]
[null,"・","□で囲まれた項目については県内業者のみ選択して下さい（県外業者については選択できません）"]
[null,"・","各ｾﾙのﾃﾞｰﾀ消去はBackspaceｷｰまたはDeleteｷｰを使用して下さい"]
[]
{"$rows_left_out":52}
{"sheet":"入力画面(入力シートその２)","index":4,"n_rows":30,"n_cols":43,"rows_kept":30,"cut":false,"hidden":true,"merged":[[29,1,29,3],[29,4,29,6],[29,7,29,13],[29,14,29,37],[29,38,29,39],[27,1,27,3],[27,4,27,6],[27,7,27,13],[27,14,27,37],[27,38,27,39],[28,1,28,3],[28,4,28,6],[28,7,28,13],[28,14,28,37],[28,38,28,39],[25,1,25,3],[25,4,25,6],[25,7,25,13],[25,14,25,37],[25,38,25,39],[26,1,26,3],[26,4,26,6],[26,7,26,13],[26,14,26,37],[26,38,26,39],[23,1,23,3],[23,4,23,6],[23,7,23,13],[23,14,23,37],[23,38,23,39],[24,1,24,3],[24,4,24,6],[24,7,24,13],[24,14,24,37],[24,38,24,39],[21,1,21,3],[21,4,21,6],[21,7,21,13],[21,14,21,37],[21,38,21,39],[22,1,22,3],[22,4,22,6],[22,7,22,13],[22,14,22,37],[22,38,22,39],[19,1,19,3],[19,4,19,6],[19,7,19,13],[19,14,19,37],[19,38,19,39],[20,1,20,3],[20,4,20,6],[20,7,20,13],[20,14,20,37],[20,38,20,39],[17,1,17,3],[17,4,17,6],[17,7,17,13],[17,14,17,37],[17,38,17,39],[18,1,18,3],[18,4,18,6],[18,7,18,13],[18,14,18,37],[18,38,18,39],[15,1,15,3],[15,4,15,6],[15,7,15,13],[15,14,15,37],[15,38,15,39],[16,1,16,3],[16,4,16,6],[16,7,16,13],[16,14,16,37],[16,38,16,39],[13,1,13,3],[13,4,13,6],[13,7,13,13],[13,14,13,37],[13,38,13,39],[14,1,14,3],[14,4,14,6],[14,7,14,13],[14,14,14,37],[14,38,14,39],[11,1,11,3],[11,4,11,6],[11,7,11,13],[11,14,11,37],[11,38,11,39],[12,1,12,3],[12,4,12,6],[12,7,12,13],[12,14,12,37],[12,38,12,39],[9,1,9,3],[9,4,9,6],[9,7,9,13],[9,14,9,37],[9,38,9,40],[10,1,10,3],[10,4,10,6],[10,7,10,13],[10,14,10,37],[10,38,10,39]]}
["営業品目調書及び登録を希望する営業品目入力表",null,null,null,null,null,null,null,null,null,null,null,null,null,null,null,null,null,null,null,null,null,"【入力シート　その２】"]
[null,"※入力の注意点"]
[null,"・","年商にしめる割合の多い順（主力取り扱い商品順）に記入して下さい（年商にしめる割合は合計100%に達しなくても結構です）"]
[null,"・","登録を希望する営業品目の希望順位を選択して下さい（希望順位が未入力の場合、データに反映されませんのでご注意ください）"]
[null,"・","主な取り扱い品目には品目名・取扱メーカー名・代理店・特約店名等を記入してください（６５文字以内）"]
[null,"・","品目「２３：その他の物品製造・販売」、「４１：その他の役務提供」を希望する場合は、業務内容を詳しく記入してください"]
[null,"・","*が付いている項目に関してはﾘｽﾄから選択して下さい"]
[null,"・","各ｾﾙのﾃﾞｰﾀ消去はBackspaceｷｰまたはDeleteｷｰを使用して下さい"]
{"$rows_left_out":23}
{"sheet":"入力画面(入力シートその３)","index":5,"n_rows":10,"n_cols":12,"rows_kept":10,"cut":false,"hidden":true,"merged":[[6,4,6,6],[7,4,7,6],[8,4,8,6],[9,4,9,6],[0,0,0,7],[1,4,1,6],[2,4,2,6],[3,4,3,6],[4,4,4,6],[5,4,5,6]]}
["登録等を受けている事業\n　　※入力の注意点\n　　・登録等を受けている事業が８つ以上の場合は別紙（任意様式）に記入のうえ提出してください。",null,null,null,null,null,null,null,null,null,null,"【入力シート　その３】"]
[null,"関連品目\nコード","品目分類名 *","許可・認可・資格等の種類","許可・認可・資格等登録番号",null,null,"許可・登録年月日",null,"例)"]
[1,{"$f":"IF(ISERROR(VLOOKUP(C3,mst!$D$2:$E$43,2,FALSE)),\"\",VLOOKUP(C3,mst!$D$2:$E$43,2,FALSE))","v":""},null,null,null,null,null,null,null,"許可・登録年月日　　s50/6/3　※1899/12/31以前の場合直接入力・・・例）明治32年12月31日"]
[2,{"$f":"IF(ISERROR(VLOOKUP(C4,mst!$D$2:$E$43,2,FALSE)),\"\",VLOOKUP(C4,mst!$D$2:$E$43,2,FALSE))","v":""}]
[3,{"$f":"IF(ISERROR(VLOOKUP(C5,mst!$D$2:$E$43,2,FALSE)),\"\",VLOOKUP(C5,mst!$D$2:$E$43,2,FALSE))","v":""}]
[4,{"$f":"IF(ISERROR(VLOOKUP(C6,mst!$D$2:$E$43,2,FALSE)),\"\",VLOOKUP(C6,mst!$D$2:$E$43,2,FALSE))","v":""}]
[5,{"$f":"IF(ISERROR(VLOOKUP(C7,mst!$D$2:$E$43,2,FALSE)),\"\",VLOOKUP(C7,mst!$D$2:$E$43,2,FALSE))","v":""}]
[6,{"$f":"IF(ISERROR(VLOOKUP(C8,mst!$D$2:$E$43,2,FALSE)),\"\",VLOOKUP(C8,mst!$D$2:$E$43,2,FALSE))","v":""}]
{"$rows_left_out":3}
{"sheet":"入力・印刷兼用(役員名簿)","index":6,"n_rows":24,"n_cols":12,"rows_kept":24,"cut":false,"hidden":true,"merged":[[15,1,15,11],[1,0,1,11],[2,0,3,0],[2,1,3,1],[2,2,3,2],[2,3,3,3],[2,4,3,4],[2,5,3,5],[2,6,2,9],[2,10,3,10],[2,11,3,11]]}
[]
["会社役員名簿"]
["番号","法人名、商号、名称等　　　　　　　　　　　　　　（法人・団体等のみ記載）","所　　在　　地　　　　　　　　　　　　　　　　　　　　　（個人の場合は、住所）","役 職 名                          （法人・団体名等のみ記載）","フリガナ","氏　　名　　　　　　　　　　　　　　　（漢字表記）","生　年　月　日",null,null,null,"性別","備考"]
[null,null,null,null,null,null,"元号","年","月","日"]
[1]
[2]
[3]
[4]
{"$rows_left_out":17}
{"sheet":"印刷画面","index":7,"n_rows":60,"n_cols":8,"rows_kept":60,"cut":false,"hidden":true,"merged":[]}
["印刷画面"]
[]
[null,"各提出書類を印刷またはプレビューすることができます。"]
[]
[null,"１．入力画面（入力シートその１～３）の必要な項目をすべて入力できましたら、下の一括印刷ボタンを"]
[null,"　　押して提出書類を印刷して下さい。"]
[null,"　（個別に書類を確認・印刷したい場合は下の各書類のプレビュー・印刷ボタンを押して下さい。）"]
[null,"　　　"]
{"$rows_left_out":53}
{"sheet":"印刷用（申請書１）","index":8,"n_rows":39,"n_cols":14,"rows_kept":39,"cut":false,"hidden":true,"merged":[[9,1,9,14],[2,1,3,10],[3,11,3,13],[4,11,5,13],[5,1,5,10],[7,10,7,13],[10,1,10,14],[11,1,11,14],[12,1,12,14],[13,1,28,1],[13,2,20,3],[13,4,14,4],[13,5,14,6],[13,7,14,7],[13,9,13,11],[13,13,13,14],[14,9,14,11],[14,12,16,15],[15,4,16,4],[15,5,15,6],[15,7,16,7],[15,9,15,11],[16,5,16,6],[16,9,16,11],[17,4,18,4],[17,5,17,6],[17,7,18,7],[17,9,17,11],[17,13,17,14],[18,5,18,6],[18,9,18,11],[18,12,20,15],[19,5,19,6],[19,9,19,11],[20,5,20,6],[20,9,20,11],[21,2,28,3],[21,4,22,4],[21,5,22,6],[21,7,22,7],[21,9,21,11],[25,4,26,4],[25,5,25,6],[25,7,26,7],[25,9,25,11],[21,13,21,14],[22,9,22,11],[22,12,24,15],[23,4,24,4],[23,5,23,6],[23,7,24,7],[23,9,23,11],[24,5,24,6],[24,9,24,11],[25,13,25,14],[26,5,26,6],[26,9,26,11],[26,12,28,15],[27,5,27,6],[27,9,27,11],[28,5,28,6],[28,9,28,11],[31,1,31,2],[31,3,31,5],[31,6,31,9],[31,10,31,15],[32,1,32,2],[32,3,32,5],[32,6,32,9],[32,10,32,15],[33,1,33,2],[33,3,33,5],[33,6,33,9],[33,10,33,15],[34,1,34,2],[34,3,34,5],[34,6,34,9],[34,10,34,15],[38,1,38,15],[35,1,35,2],[35,3,35,5],[35,6,35,9],[35,10,35,15],[36,1,36,2],[36,3,36,5],[36,6,36,9],[36,10,36,15]]}
[]
[null,"様式第3号の１"]
[null,"野洲市入札参加資格審査申請書"]
[null,null,null,null,null,null,null,null,null,null,null,"受付番号"]
[null,null,null,null,null,null,null,null,null,null,null,"Ｂ－　　　　"]
[null,"（物品供給及び役務提供等）"]
[]
[null,null,null,null,null,null,null,null,null,null,"令和　　　年　　　月　　　日"]
{"$rows_left_out":32}
{"sheet":"印刷用（申請書２）","index":9,"n_rows":38,"n_cols":18,"rows_kept":38,"cut":false,"hidden":true,"merged":[[3,1,3,3],[3,4,3,10],[3,11,3,16],[3,17,3,18],[4,1,4,3],[4,4,4,10],[4,11,4,16],[4,17,4,18],[5,1,5,3],[5,4,5,10],[5,11,5,16],[5,17,5,18],[6,1,6,3],[6,4,6,10],[6,11,6,16],[6,17,6,18],[7,1,7,3],[7,4,7,10],[7,11,7,16],[7,17,7,18],[8,1,8,3],[8,4,8,10],[8,11,8,16],[8,17,8,18],[9,1,9,3],[9,4,9,10],[9,11,9,16],[9,17,9,18],[10,1,10,3],[10,4,10,10],[10,11,10,16],[10,17,10,18],[11,1,11,3],[11,4,11,10],[11,11,11,16],[11,17,11,18],[13,1,14,1],[13,2,14,4],[13,5,14,5],[13,6,14,11],[13,12,14,13],[13,15,14,15],[19,2,19,4],[19,6,19,13],[37,1,37,18],[13,16,13,17],[14,16,14,17],[16,2,16,4],[16,6,16,7],[16,10,16,12],[18,2,18,4],[18,6,18,13]]}
[]
[null,"　様式第3号の１"]
[null,"　営業に関し必要な許可・認可・資格等"]
[null,"関　連\nコード\n番　号",null,null,"許可・認可・資格等の種類",null,null,null,null,null,null,"許可・認可・資格等の登録番号",null,null,null,null,null,"許可・登録等年月日"]
[null,{"$f":"IF(sys!Q2=\"\",\"\",sys!Q2)","v":""},null,null,{"$f":"IF(sys!R2=\"\",\"\",sys!R2)","v":""},null,null,null,null,null,null,{"$f":"IF(sys!S2=\"\",\"\",sys!S2)","v":""},null,null,null,null,null,{"$f":"IF(sys!T2=\"\",\"\",sys!T2)","v":""}]
[null,{"$f":"IF(sys!Q3=\"\",\"\",sys!Q3)","v":""},null,null,{"$f":"IF(sys!R3=\"\",\"\",sys!R3)","v":""},null,null,null,null,null,null,{"$f":"IF(sys!S3=\"\",\"\",sys!S3)","v":""},null,null,null,null,null,{"$f":"IF(sys!T3=\"\",\"\",sys!T3)","v":""}]
[null,{"$f":"IF(sys!Q4=\"\",\"\",sys!Q4)","v":""},null,null,{"$f":"IF(sys!R4=\"\",\"\",sys!R4)","v":""},null,null,null,null,null,null,{"$f":"IF(sys!S4=\"\",\"\",sys!S4)","v":""},null,null,null,null,null,{"$f":"IF(sys!T4=\"\",\"\",sys!T4)","v":""}]
[null,{"$f":"IF(sys!Q5=\"\",\"\",sys!Q5)","v":""},null,null,{"$f":"IF(sys!R5=\"\",\"\",sys!R5)","v":""},null,null,null,null,null,null,{"$f":"IF(sys!S5=\"\",\"\",sys!S5)","v":""},null,null,null,null,null,{"$f":"IF(sys!T5=\"\",\"\",sys!T5)","v":""}]
{"$rows_left_out":31}
{"sheet":"印刷用（経営規模等総括表）","index":10,"n_rows":36,"n_cols":20,"rows_kept":36,"cut":false,"hidden":true,"merged":[[5,17,6,20],[1,1,1,8],[2,1,2,20],[3,1,4,1],[3,2,4,6],[3,7,4,7],[3,8,4,20],[5,1,6,1],[5,2,6,6],[5,7,6,7],[5,8,6,15],[5,16,6,16],[7,1,10,2],[7,3,10,3],[7,4,8,6],[7,7,10,7],[7,8,8,20],[9,4,10,6],[9,8,10,15],[9,16,10,16],[9,17,10,20],[11,1,18,2],[11,3,12,3],[11,4,12,6],[11,7,12,7],[11,8,12,8],[15,3,16,3],[15,4,16,6],[15,7,16,7],[15,8,16,8],[11,12,12,20],[13,3,14,3],[13,4,13,6],[13,7,14,7],[13,8,14,8],[13,9,13,11],[13,12,13,20],[14,4,14,6],[14,9,14,11],[14,12,14,20],[11,9,12,11],[15,9,16,11],[15,12,16,20],[17,3,18,3],[17,4,18,6],[17,7,18,7],[17,9,18,11],[17,12,18,20],[19,2,20,6],[19,9,20,11],[19,12,20,20],[21,2,21,6],[21,9,22,11],[21,12,22,20],[22,2,22,6],[23,20,24,20],[25,2,26,6],[25,8,26,8],[25,9,26,11],[25,12,26,12],[25,13,26,13],[25,14,26,19],[25,20,26,20],[23,1,24,3],[23,4,24,9],[23,10,24,10],[23,11,24,11],[23,12,24,16],[23,17,24,19],[31,2,32,6],[31,8,32,12],[31,14,32,18],[31,19,32,20],[27,2,28,6],[27,9,27,10],[27,14,28,18],[27,19,28,20],[28,9,28,10],[29,2,29,6],[29,9,29,10],[29,14,30,18],[29,19,30,20],[30,2,30,4],[30,9,30,10]]}
[]
[null,"様式第３号の２"]
[null,"経　 営　 規　 模　 等　 総　 括　 表"]
[null,null,"商号又は名称",null,null,null,null,null,"##### 入力漏れがあります #####"]
[]
[null,null,"本店所在地",null,null,null,null,null,"##### 入力漏れがあります #####",null,null,null,null,null,null,null,"電話","##### 入力漏れがあります #####"]
[]
[null,"委任先",null,null,"商号又は名称"]
{"$rows_left_out":29}
{"sheet":"印刷用（営業品目調書）","index":11,"n_rows":32,"n_cols":6,"rows_kept":32,"cut":false,"hidden":true,"merged":[[2,1,2,5]]}
[]
[null,"様式第３号の３"]
[null,"営　業　品　目　調　書"]
[null,"営業の種類"]
[null,null,"品目コード","分　　類","主　な　取　り　扱　い　品　目","年商にしめる割合"]
[null,null,null,null,null,"　（％）　で記入"]
[null,null,{"$f":"IF(sys!D2=\"\",\"\",sys!D2)","v":""},{"$f":"IF(sys!E2=\"\",\"\",sys!E2)","v":""},{"$f":"IF(sys!F2=\"\",\"\",sys!F2)","v":""},{"$f":"IF(sys!G2=\"\",\"\",sys!G2)","v":""}]
[null,null,{"$f":"IF(sys!D3=\"\",\"\",sys!D3)","v":""},{"$f":"IF(sys!E3=\"\",\"\",sys!E3)","v":""},{"$f":"IF(sys!F3=\"\",\"\",sys!F3)","v":""},{"$f":"IF(sys!G3=\"\",\"\",sys!G3)","v":""}]
{"$rows_left_out":25}
{"sheet":"印刷用（誓約書）","index":12,"n_rows":19,"n_cols":9,"rows_kept":19,"cut":false,"hidden":true,"merged":[[10,1,10,8],[5,1,5,9],[6,1,6,8],[7,1,7,8],[8,1,8,8],[9,1,9,8],[12,6,12,8],[15,6,15,9],[16,6,16,9],[17,6,17,9],[18,6,18,7]]}
[]
[null,"様式第３号の４"]
[null,null,null,null,null,null,null,"受付番号"]
[null,null,null,null,null,null,null," Ｂ"]
[]
[null,"誓　約　書"]
[null,"　野洲市からの発注に対し、要求に応じられないにもかかわらず入札・見積等をし、納期の遅延"]
[null,"その他不当または不備により事務執行に支障を生じ迷惑をおよぼした場合には、直ちに指示に従"]
{"$rows_left_out":12}
{"sheet":"印刷用（委任状）","index":13,"n_rows":45,"n_cols":12,"rows_kept":45,"cut":false,"hidden":true,"merged":[[2,1,4,12],[8,3,8,10],[9,3,9,4],[9,5,9,10],[9,11,11,11],[10,3,10,4],[10,5,10,10],[11,3,11,4],[11,5,11,10],[44,9,44,11],[18,2,18,12],[31,3,31,6],[31,8,31,10],[33,10,33,12],[39,5,39,7],[39,9,40,12],[41,3,41,4],[41,5,41,7],[41,9,42,12],[43,5,43,7],[43,9,43,12]]}
[]
[null,"共通様式１号"]
[null,"委　　任　　状"]
[]
[]
[]
[]
[]
{"$rows_left_out":38}
{"sheet":"印刷用(使用印鑑届)","index":14,"n_rows":41,"n_cols":9,"rows_kept":41,"cut":false,"hidden":true,"merged":[[13,3,13,4],[13,8,13,10],[2,1,4,11],[11,3,11,4],[11,8,11,10],[12,3,12,4],[12,8,12,10],[40,8,40,14],[23,3,23,5],[37,4,37,6],[37,8,37,14],[38,4,38,6],[38,8,38,14],[39,4,39,6],[39,8,39,14]]}
[]
[null,"共通様式２号"]
[null,"使　用　印　鑑　届"]
[]
[]
[]
[]
[]
{"$rows_left_out":34}
{"sheet":"印刷用(暴力団排除条例誓約書)","index":15,"n_rows":39,"n_cols":8,"rows_kept":39,"cut":false,"hidden":true,"merged":[[38,5,38,6],[0,1,1,8],[8,1,8,8],[35,5,35,8],[36,5,36,8],[37,5,37,8]]}
[null,"誓　　　　約　　　　書"]
[]
[]
[null,"　野洲市入札参加資格審査申請に関し、野洲市暴力団排除条例により、下記の"]
[null,"事項について、事実と相違ないことを誓約します。"]
[null,"　なお、市が必要な場合には、誓約書および会社役員名簿を滋賀県警察本部に"]
[null,"提出することについて承諾します。"]
[]
{"$rows_left_out":32}
{"sheet":"印刷用(市内事務所等調書)","index":16,"n_rows":37,"n_cols":11,"rows_kept":37,"cut":false,"hidden":true,"merged":[[2,1,2,11],[3,5,3,11],[4,5,4,11],[5,9,5,11],[8,2,8,11]]}
[]
[null,"様式第３号の５"]
[null,"市　内　事　務　所　等　調　書"]
[null,null,"商号または名称",null,null,"##### 入力漏れがあります #####"]
[null,null,"所在地",null,null,"##### 入力漏れがあります #####"]
[null,null,"施設",null,null,"１．自社所有",null,"２．賃貸",null,"３．その他（　　　　　　　　　　　）"]
[null,null,"職員数",null,null,"事務職員",null,"人","技術職員",null,"人"]
[]
{"$rows_left_out":30}
{"sheet":"印刷用(受理証)","index":17,"n_rows":45,"n_cols":10,"rows_kept":45,"cut":false,"hidden":true,"merged":[[24,5,24,9],[30,1,30,9],[38,3,39,7],[1,3,1,6],[2,3,2,6],[3,3,3,6],[4,3,12,6],[18,1,19,6],[23,5,23,9]]}
["様式第３号の６"]
[null,null,null,"受理証"]
[null,null,null,"物品・役務提供用　Ｂ"]
[null,null,null,"受付印・受理年月日"]
[]
[]
[]
[]
{"$rows_left_out":38}
{"sheet":"印刷用(提出書類チェック表（市内）)","index":18,"n_rows":37,"n_cols":9,"rows_kept":37,"cut":false,"hidden":true,"merged":[[9,1,9,3],[9,4,9,5],[1,0,1,8],[4,0,5,0],[4,1,5,3],[4,4,5,5],[4,6,5,6],[4,7,4,8],[6,4,6,5],[7,1,7,3],[7,4,7,5],[8,1,8,3],[8,4,8,5],[10,1,10,3],[10,4,10,5],[11,1,12,1],[11,4,11,5],[12,2,12,3],[12,4,12,5],[13,0,14,0],[13,1,13,3],[13,4,13,5],[13,7,14,7],[13,8,14,8],[14,1,14,3],[14,4,14,5],[15,1,15,3],[15,4,15,5],[16,1,16,3],[16,4,16,5],[17,1,17,3],[17,4,17,5],[18,1,18,3],[18,4,18,5],[19,1,19,3],[19,4,19,5],[20,1,20,3],[20,4,20,5],[21,1,21,3],[21,4,21,5],[22,1,22,3],[22,4,22,5],[23,1,23,3],[23,4,23,5],[24,1,24,3],[24,4,24,5],[25,1,25,3],[25,4,25,5],[26,1,26,3],[26,4,26,5],[29,0,29,4],[31,0,31,2],[31,3,31,4],[32,0,32,2],[32,3,32,4],[33,6,36,8],[34,0,34,2],[34,3,34,4],[35,0,35,2],[35,3,35,4],[33,0,33,2],[33,3,33,4]]}
["様式第３号の７",null,null,null,null,null,null,null,"【市内用】"]
["提出書類チェック表　【物品供給及び役務提供】"]
[]
[null,null,null,null,null,null,null,null,"（各１部）"]
["NO.","必要書類",null,null,"様式",null,"備考","チェック欄"]
[null,null,null,null,null,null,null,"申請者","市"]
["①","入札参加資格審査申請書",null,null,"市指定様式第３号の１"]
["②","経営規模等総括表",null,null,"市指定様式第３号の２"]
{"$rows_left_out":30}
{"sheet":"印刷用(提出書類チェック表（市外）)","index":19,"n_rows":35,"n_cols":9,"rows_kept":35,"cut":false,"hidden":true,"merged":[[31,0,31,2],[31,3,31,4],[31,6,34,8],[32,0,32,2],[32,3,32,4],[33,0,33,2],[33,3,33,4],[30,0,30,2],[30,3,30,4],[21,1,21,3],[21,4,21,5],[22,1,22,3],[22,4,22,5],[23,1,23,3],[23,4,23,5],[24,1,24,3],[24,4,24,5],[27,0,27,4],[29,0,29,2],[29,3,29,4],[18,1,18,3],[18,4,18,5],[19,1,19,3],[19,4,19,5],[20,1,20,3],[20,4,20,5],[15,1,15,3],[15,4,15,5],[16,1,16,3],[16,4,16,5],[17,1,17,3],[17,4,17,5],[12,7,13,7],[12,8,13,8],[13,1,13,3],[13,4,13,5],[14,1,14,3],[14,4,14,5],[10,1,10,3],[10,4,10,5],[11,4,11,5],[12,0,13,0],[12,1,12,3],[12,4,12,5],[9,1,9,3],[9,4,9,5],[1,0,1,8],[4,0,5,0],[4,1,5,3],[4,4,5,5],[4,6,5,6],[4,7,4,8],[6,4,6,5],[7,1,7,3],[7,4,7,5],[8,1,8,3],[8,4,8,5]]}
["様式第３号の７",null,null,null,null,null,null,null,"【市外用】"]
["提出書類チェック表　【物品供給及び役務提供】"]
[]
[null,null,null,null,null,null,null,null,"（各１部）"]
["NO.","必要書類",null,null,"様式",null,"備考","チェック欄"]
[null,null,null,null,null,null,null,"申請者","市"]
["①","入札参加資格審査申請書",null,null,"市指定様式第３号の１"]
["②","経営規模等総括表",null,null,"市指定様式第３号の２"]
{"$rows_left_out":28}
{"sheet":"印刷用(CDラベル・宛名ラベル)","index":20,"n_rows":39,"n_cols":4,"rows_kept":39,"cut":false,"hidden":true,"merged":[[3,2,4,4],[7,2,10,4],[11,3,11,4],[30,3,30,9]]}
[]
[]
[null,null,"野洲市令和６・７年度"]
[null,null,"【物品・役務の提供】"]
[]
[]
[]
[null,null,""]
{"$rows_left_out":31}